Articles of 机器人工作室

我可以在Android Studio中预览打开的导航抽屉吗?

我正在制作一个具有导航抽屉的应用程序。 我的电脑无法运行AVD仿真器。 即使使用最小的AVD,我也等了好几个小时而且没有启动。 话虽这么说,我不得不依靠Android Studio设计师来看看应用程序的外观。 在创建导航抽屉活动时,有什么方法可以切换它在设计器上打开吗?

java.lang.AssertionError:意外的节点Pythonid; nodes = [org.jetbrains.plugins.terminal,org.jetbrains.plugins.javaFX

有谁知道以下问题的解决方法是什么? 除了以下内容我找不到任何有用的内容: https : //code.google.com/p/android/issues/detail?id = 164202 Android Studio要求我安装一些插件后问题出现了: 内部错误。 请报告https://code.google.com/p/android/issues java.lang.AssertionError: Unexpected node Pythonid; nodes=[org.jetbrains.plugins.terminal, org.jetbrains.plugins.javaFX, org.jetbrains.plugins.gradle, org.jetbrains.plugins.github, org.jetbrains.java.decompiler, org.jetbrains.idea.maven, org.jetbrains.android, org.intellij.intelliLang, org.intellij.groovy, org.editorconfig.editorconfigjetbrains, hg4idea, com.millennialmedia.intellibot, com.jivesoftware.robot.intellij.plugin, com.intellij.ui-designer-new, com.intellij.tasks, com.intellij.properties, com.intellij.modules.xml, com.intellij.modules.xdebugger, com.intellij.modules.vcs, com.intellij.modules.python, com.intellij.modules.platform, com.intellij.modules.lang, com.intellij.modules.json, com.intellij.modules.java, com.intellij.modules.androidstudio, com.intellij.modules.all, com.intellij.java-i18n, com.intellij.copyright, com.intellij, com.google.gct.testing, com.google.gct.login, com.google.gct, amailp.intellij.robot, TestNG-J, Subversion, JUnit, Git4Idea, Coverage, CVS] at […]

在Android Studio中使用GameCircleSDK时,多个dex文件定义Lcom / amazon / ags / BuildConfig

我最近从Eclipse导入了Android项目到AndroidStudio。 一切都进行得很顺利,我能够解决大多数问题,除非它归结为GameCircleSDK库模块。 我一直收到以下错误: UNEXPECTED TOP-LEVEL EXCEPTION: com.android.dex.DexException: Multiple dex files define Lcom/amazon/ags/BuildConfig; 事实certificate, com.amazon.ags.BuildConfig.class确实包含在两个jar中: classes.jar (在构建期间生成)和GameCircleSDK / libs / gamecirclesdk.jar 。 解决问题的唯一方法是解压缩gamecirclesdk.jar ,删除BuildConfig.class ,然后再将其拉回来。 我搜索了互联网的解决方案,我尝试了这里列出的所有内容,但似乎没有解决我的问题。 我错过了什么吗?

程序types已存在:android.support.v13.view.DragStartHelper $ 1

自昨天以来我一直在寻找这个错误的解决方案。 我尝试了一切。 我删除了我的.idea和.gradle文件。 我甚至使缓存无效并重启我的android工作室。 我也重新安装我的android工作室,但无济于事。 我仍然收到此错误。 我大约一个月没碰到我的项目。 当我回来。 我更新了我的android工作室,并试图运行我的项目,并受到了这个错误的欢迎 java.lang.RuntimeException: java.lang.RuntimeException: com.android.builder.dexing.DexArchiveMergerException: Error while merging dex archives: Program type already present: android.support.v13.view.DragStartHelper$1 我的gradle上启用了multidex。 一个月前我没有这个问题。 在更新我的android工作室后,我得到了这个。 有人有解决方案吗? 我正在使用的所有库都应该没问题,因为我能够在一个月前没有出现此错误的情况下发布我的应用程序。

必须将类声明为abstract或实现抽象方法错误

这是我的代码,假设在按下按钮时更改一些文本: – public class MyActivity extends ActionBarActivity { TextView txtview; Button butto; @Override protected void onCreate(Bundle savedInstanceState) { super.onCreate(savedInstanceState); setContentView(R.layout.activity_my); ImageView imageView = (ImageView) findViewById(R.id.image); txtview = (TextView) findViewById(R.id.text); butto = (Button) findViewById(R.id.buttn); butto.setOnClickListener(new View.OnClickListener() { public void Onclick(View paramView) { txtview.setText(“You Clicked it!”); } }); }} View.OnClickListener下划线,它给出了错误“Class必须被声明为abstract或实现抽象方法”。 这段代码大多是从互联网上复制而来的,假设工作正常。 可能只是Android Studio错误。 我怎样才能让它发挥作用?

Android工作室和设备外部

是否可以在android studio中使用外部设备模拟应用程序? 我有一台设备连接到计算机,但是当您运行该应用程序时,它无法识别该设备。 注意:激活接受未知源的模式和调试模式。

java.lang.RuntimeException:setAudioSource失败

我是android开发的新手。 我只是想用6.0.1 Marshmallow设备用android studio(2.1.1)测试录制音频。 public class MainActivity extends AppCompatActivity { Button start, stop; public MediaRecorder recorder = null; public String fileextn = “.mp4”; @Override protected void onCreate(Bundle savedInstanceState) { super.onCreate(savedInstanceState); setContentView(R.layout.activity_main); start = (Button) findViewById(R.id.start_button); stop = (Button) findViewById(R.id.stop_button); start.setOnClickListener(new View.OnClickListener(){ @Override public void onClick(View v) { switch (v.getId()) { case R.id.start_button: startRecord(); case R.id.stop_button: […]

Ubuntu 17.10上的Android工作室:AVD Nexus_5_API_22的模拟器进程被终止

我在我的ubuntu上重新安装了android-studio 3.0。 所有流程安装都没问题。 现在,我创建了一个新项目。 但是当我尝试运行时,我在控制台上得到了这个: 11/10 21:10:19: Launching app Error while waiting for the device: The emulator process for AVD Nexus_5_API_22 was killed. 请问有什么想法吗? 更新这里是模拟器日志: Executing tasks: [:app:assembleDebug] Emulator: libGL error: unable to load driver: i965_dri.so Emulator: libGL error: driver pointer missing Emulator: libGL error: failed to load driver: i965 Emulator: libGL error: unable to […]

Android Studio中使用Proguard的Google Play服务

我最近从Eclipse迁移到了Android Studios。 我通过eclipse使用Proguard我的应用程序,现在我已经移动我遇到以下错误。 错误: ProGuard: [myApp] Warning: com.google.android.gms.auth.GoogleAuthUtil: can’t find referenced field ‘int auth_client_availability_notification_title’ in class com.google.android.gms.R$string ProGuard: [myApp] Warning: com.google.android.gms.auth.GoogleAuthUtil: can’t find referenced field ‘int auth_client_play_services_err_notification_msg’ in class com.google.android.gms.R$string ProGuard: [myApp] Warning: com.google.android.gms.auth.GoogleAuthUtil: can’t find referenced field ‘int auth_client_requested_by_msg’ in class com.google.android.gms.R$string ProGuard: [myApp] Warning: com.squareup.picasso.OkHttpLoader: can’t find referenced class com.squareup.okhttp.OkHttpClient ProGuard: [myApp] Warning: […]

当我将PNG文件放在drawable文件夹中时,Android Studio崩溃(aapt.exe返回42)

在昨天的更新之后,它将不会使用这两个PNG图像构建或运行项目作为背景图像。 一旦我删除这些图像一切正常(我将图像放在drawable文件夹中)。 :app:mergeDebugResources FAILED C:\Users\Daedlues\Desktop\Android-Studio-Projects\AndroidInterView\app\src\main\res\drawable\middle.png Error:Error: com.android.ide.common.process.ProcessException: org.gradle.process.internal.ExecException: Process ‘command ‘C:\Users\Daedlues\Desktop\Work\SDK\build-tools\21.1.2\aapt.exe” finished with non-zero exit value 42 Error:Execution failed for task ‘:app:mergeDebugResources’. > C:\Users\Daedlues\Desktop\Android-Studio-Projects\AndroidInterView\app\src\main\res\drawable\middle.png: Error: com.android.ide.common.process.ProcessException: org.gradle.process.internal.ExecException: Process ‘command ‘C:\Users\Daedlues\Desktop\Work\SDK\build-tools\21.1.2\aapt.exe” finished with non-zero exit value 42 Information:BUILD FAILED