错误:执行任务':app:processDebugResources'失败。 >在指数4

我在修改最新的SDK更新2之后构build我的项目时遇到问题(对不起,我不记得版本号)。我以前成功运行代码。 我不认为在我的项目中有任何错误。我经常因为“IDE内部错误发生”而得到错误信息是与此有关的任何事情。 请帮助thanks.Required代码如下

应用程序/的build.gradle:

apply plugin: 'com.android.application' apply plugin: 'com.google.gms.google-services' android { compileSdkVersion 23 buildToolsVersion "23.0.1" defaultConfig { applicationId "io.sleeko.board" minSdkVersion 15 targetSdkVersion 23 versionCode 1 versionName "1.0" multiDexEnabled true } buildTypes { release { minifyEnabled false proguardFiles getDefaultProguardFile('proguard-android.txt'), 'proguard-rules.pro' } } } dependencies { compile fileTree(dir: 'libs', include: ['*.jar']) compile('cn.trinea.android.view.autoscrollviewpager:android-auto-scroll-view-pager:1.1.2') { exclude module: 'support-v4' } compile 'com.android.support:recyclerview-v7:23.0.1' compile('com.github.nkzawa:socket.io-client:0.6.0') { exclude group: 'org.json', module: 'json' } // compile project(':Emojicon') compile 'com.android.support:appcompat-v7:23.1.0' compile 'com.android.support:design:23.1.0' compile 'com.google.android.gms:play-services-identity:8.1.0' compile 'com.google.android.gms:play-services-plus:8.1.0' compile 'com.android.support:recyclerview-v7:23.1.0' compile 'me.relex:circleindicator:1.1.5@aar' compile 'de.greenrobot:eventbus:2.4.0' compile 'com.android.support:cardview-v7:23.1.0' compile 'com.google.code.gson:gson:2.4' compile 'com.github.rahatarmanahmed:circularprogressview:2.3.2' compile 'com.squareup.picasso:picasso:2.5.2' compile 'com.github.traex.rippleeffect:library:1.3' compile 'com.alexbbb:uploadservice:1.4' compile 'com.github.satyan:sugar:1.3' compile 'com.mikhaellopez:circularimageview:2.0.2' compile 'com.facebook.android:facebook-android-sdk:4.7.0' } 

消息Gradle构build:

 Information:Gradle tasks [:app:generateDebugSources, :app:generateDebugAndroidTestSources] :app:preBuild UP-TO-DATE :app:preDebugBuild UP-TO-DATE :app:checkDebugManifest :app:preReleaseBuild UP-TO-DATE :app:prepareComAlexbbbUploadservice14Library UP-TO-DATE :app:prepareComAndroidSupportAppcompatV72310Library UP-TO-DATE :app:prepareComAndroidSupportCardviewV72310Library UP-TO-DATE :app:prepareComAndroidSupportDesign2310Library UP-TO-DATE :app:preDebugAndroidTestBuild UP-TO-DATE :app:prepareComAndroidSupportMultidex101Library UP-TO-DATE :app:prepareComAndroidSupportRecyclerviewV72310Library UP-TO-DATE :app:prepareComAndroidSupportSupportV42310Library UP-TO-DATE :app:prepareComFacebookAndroidFacebookAndroidSdk470Library UP-TO-DATE :app:prepareComGithubRahatarmanahmedCircularprogressview232Library UP-TO-DATE :app:prepareComGithubSatyanSugar13Library UP-TO-DATE :app:prepareComGithubTraexRippleeffectLibrary13Library UP-TO-DATE :app:prepareComGoogleAndroidGmsPlayServicesAds810Library UP-TO-DATE :app:prepareComGoogleAndroidGmsPlayServicesAnalytics810Library UP-TO-DATE :app:prepareComGoogleAndroidGmsPlayServicesAppindexing810Library UP-TO-DATE :app:prepareComGoogleAndroidGmsPlayServicesBase810Library UP-TO-DATE :app:prepareComGoogleAndroidGmsPlayServicesBasement810Library UP-TO-DATE :app:prepareComGoogleAndroidGmsPlayServicesIdentity810Library UP-TO-DATE :app:prepareComGoogleAndroidGmsPlayServicesMeasurement810Library UP-TO-DATE :app:prepareComGoogleAndroidGmsPlayServicesPlus810Library UP-TO-DATE :app:prepareComMikhaellopezCircularimageview202Library UP-TO-DATE :app:prepareMeRelexCircleindicator115Library UP-TO-DATE :app:prepareDebugDependencies :app:compileDebugAidl :app:compileDebugRenderscript :app:generateDebugBuildConfig UP-TO-DATE :app:generateDebugAssets UP-TO-DATE :app:mergeDebugAssets UP-TO-DATE :app:generateDebugResValues UP-TO-DATE :app:processDebugGoogleServices :app:generateDebugResources :app:mergeDebugResources :app:processDebugManifest UP-TO-DATE :app:processDebugResources FAILED Error:Execution failed for task ':app:processDebugResources'. > at index 4 Information:BUILD FAILED Information:Total time: 24.365 secs Information:1 error Information:0 warnings Information:See complete output in console 

事件日志

 3:26:52 PM NullPointerException: Failed to set up Android modules in project 

点击NullPointerException它说,要报告给谷歌细节如下:

 Failed to set up Android modules in project 'bridgewith' java.lang.NullPointerException at com.intellij.openapi.util.io.FileUtilRt.toSystemIndependentName(FileUtilRt.java:207) at com.intellij.openapi.util.io.FileUtil.toSystemIndependentName(FileUtil.java:634) at org.jetbrains.android.sdk.AndroidSdkUtils.getPlatformDir(AndroidSdkUtils.java:218) at org.jetbrains.android.sdk.AndroidSdkUtils.getPlatformAndAddOnJars(AndroidSdkUtils.java:122) at org.jetbrains.android.sdk.AndroidSdkUtils.getLibraryRootsForTarget(AndroidSdkUtils.java:156) at org.jetbrains.android.sdk.AndroidSdkUtils.setUpSdk(AndroidSdkUtils.java:409) at org.jetbrains.android.sdk.AndroidSdkUtils.createNewAndroidPlatform(AndroidSdkUtils.java:359) at org.jetbrains.android.sdk.AndroidSdkUtils.createNewAndroidPlatform(AndroidSdkUtils.java:336) at org.jetbrains.android.sdk.AndroidSdkUtils.createNewAndroidPlatform(AndroidSdkUtils.java:327) at org.jetbrains.android.sdk.AndroidSdkUtils.tryToCreateAndroidSdk(AndroidSdkUtils.java:617) at com.android.tools.idea.gradle.customizer.android.AndroidSdkModuleCustomizer.customizeModule(AndroidSdkModuleCustomizer.java:92) at com.android.tools.idea.gradle.customizer.android.AndroidSdkModuleCustomizer.customizeModule(AndroidSdkModuleCustomizer.java:48) at com.android.tools.idea.gradle.service.AndroidGradleModelDataService.customizeModule(AndroidGradleModelDataService.java:330) at com.android.tools.idea.gradle.service.AndroidGradleModelDataService.access$100(AndroidGradleModelDataService.java:88) at com.android.tools.idea.gradle.service.AndroidGradleModelDataService$1.run(AndroidGradleModelDataService.java:159) at com.intellij.openapi.command.WriteCommandAction$Simple.run(WriteCommandAction.java:166) at com.intellij.openapi.application.RunResult.run(RunResult.java:38) at com.intellij.openapi.command.WriteCommandAction$2$1.run(WriteCommandAction.java:114) at com.intellij.openapi.application.impl.ApplicationImpl.runWriteAction(ApplicationImpl.java:931) at com.intellij.openapi.command.WriteCommandAction$2.run(WriteCommandAction.java:111) at com.intellij.openapi.command.impl.CoreCommandProcessor.executeCommand(CoreCommandProcessor.java:124) at com.intellij.openapi.command.impl.CoreCommandProcessor.executeCommand(CoreCommandProcessor.java:99) at com.intellij.openapi.command.WriteCommandAction.performWriteCommandAction(WriteCommandAction.java:108) at com.intellij.openapi.command.WriteCommandAction.execute(WriteCommandAction.java:80) at com.android.tools.idea.gradle.service.AndroidGradleModelDataService.doImport(AndroidGradleModelDataService.java:136) at com.android.tools.idea.gradle.service.AndroidGradleModelDataService.importData(AndroidGradleModelDataService.java:122) at com.intellij.openapi.externalSystem.service.project.manage.ProjectDataManager.importData(ProjectDataManager.java:132) at com.intellij.openapi.externalSystem.service.project.manage.ProjectDataManager.importData(ProjectDataManager.java:102) at com.intellij.openapi.externalSystem.service.project.manage.ProjectDataManager.importData(ProjectDataManager.java:141) at com.intellij.openapi.externalSystem.service.project.manage.ProjectDataManager.importData(ProjectDataManager.java:148) at com.android.tools.idea.gradle.util.Projects$1$1$1.run(Projects.java:130) at com.intellij.openapi.roots.impl.ProjectRootManagerImpl.mergeRootsChangesDuring(ProjectRootManagerImpl.java:328) at com.android.tools.idea.gradle.util.Projects$1$1.run(Projects.java:126) at com.intellij.openapi.application.impl.ApplicationImpl.runWriteAction(ApplicationImpl.java:931) at com.android.tools.idea.gradle.util.Projects$1.run(Projects.java:122) at com.intellij.util.ui.UIUtil.invokeAndWaitIfNeeded(UIUtil.java:2369) at com.android.tools.idea.gradle.util.Projects.populate(Projects.java:115) at com.android.tools.idea.gradle.project.ProjectSetUpTask$2.run(ProjectSetUpTask.java:113) at com.intellij.ide.startup.impl.StartupManagerImpl$7.run(StartupManagerImpl.java:369) at java.awt.event.InvocationEvent.dispatch(InvocationEvent.java:311) at java.awt.EventQueue.dispatchEventImpl(EventQueue.java:756) at java.awt.EventQueue.access$500(EventQueue.java:97) at java.awt.EventQueue$3.run(EventQueue.java:709) at java.awt.EventQueue$3.run(EventQueue.java:703) at java.security.AccessController.doPrivileged(Native Method) at java.security.ProtectionDomain$JavaSecurityAccessImpl.doIntersectionPrivilege(ProtectionDomain.java:76) at java.awt.EventQueue.dispatchEvent(EventQueue.java:726) at com.intellij.ide.IdeEventQueue.defaultDispatchEvent(IdeEventQueue.java:734) at com.intellij.ide.IdeEventQueue._dispatchEvent(IdeEventQueue.java:569) at com.intellij.ide.IdeEventQueue.dispatchEvent(IdeEventQueue.java:382) at java.awt.EventDispatchThread.pumpOneEventForFilters(EventDispatchThread.java:201) at java.awt.EventDispatchThread.pumpEventsForFilter(EventDispatchThread.java:116) at java.awt.EventDispatchThread.pumpEventsForHierarchy(EventDispatchThread.java:105) at java.awt.EventDispatchThread.pumpEvents(EventDispatchThread.java:101) at java.awt.EventDispatchThread.pumpEvents(EventDispatchThread.java:93) at java.awt.EventDispatchThread.run(EventDispatchThread.java:82) 

Solutions Collecting From Web of "错误:执行任务':app:processDebugResources'失败。 >在指数4"

尝试最新版本的Android SDK构build工具。

 buildToolsVersion "23.0.3" 

祝你好运。

我有同样的问题。 然后我尝试了#195094问题的解决scheme,它工作。

我的问题可能是由于我在更新SDK工具的同时更新了Android Studio的错误,试图在不closuresAS的情况下更新它们。 因此,SDK经理将该软件包标记为部分安装。 完成安装后,将buildtoolsversion设置为23.0.2,然后“使caching失效并重新启动”问题消失了!

我有同样的问题,我注意到Android 6.0部分安装。 完成下载后,一切工作。 这很难想象,因为Android 6.0以前工作,然后决定尝试新的模拟器和下载的系统映像,我想加载这些没有完成。

正如您可能已经发现的那样,由于许多原因,这个错误是可见的。 因此,您需要find错误背后的实际原因。

导航到android文件夹并发出下面的命令;

gradlew – 信息清洁生成

这将列出实际的问题,纠正并重做构build。

希望这是有帮助的!

用这个 :

 buildToolsVersion "21.0.1" 

你会在文件app / build.gradle中find这个设置。

基于以下日志文​​件:

“无法在项目中设置Android模块”bridgewith“java.lang.NullPointerException at com.intellij.openapi.util.io.FileUtilRt.toSystemIndependentName(FileUtilRt.java:207)at com.intellij.openapi.util.io.FileUtil .toSystemIndependentName(FileUtil.java:634)at org.jetbrains.android.sdk.AndroidSdkUtils.getPlatformDir(AndroidSdkUtils.java:218)at org.jetbrains.android.sdk.AndroidSdkUtils.getPlatformAndAddOnJars(AndroidSdkUtils.java:122)at org。 jetbrains.android.sdk.AndroidSdkUtils.getLibraryRootsForTarget(AndroidSdkUtils.java:156)at org.jetbrains.android.sdk.AndroidSdkUtils.setUpSdk(AndroidSdkUtils.java:409)at org.jetbrains.android.sdk.AndroidSdkUtils.createNewAndroidPlatform(AndroidSdkUtils。 Java的:359)”

我认为这是您的Android Studio / Intellij IDE的问题。 请在您的程序和function中卸载Android Studio。 这里:

在这里输入图像说明

然后再次重新安装Andriod Studio。 转到Google的Android Studio下载网站并下载并安装IDE。

我有一个类似的错误,问题来自我的用户/ android-sdks / platform-tools文件夹中的一个损坏的adb.exe文件。 所以我必须删除我的平台工具文件夹,然后使用SDK Manager重新安装平台工具。